Target
RAC-gamma serine/threonine-protein kinase
Ligand
BDBM15169
Substrate
biotinylated Akt peptide substrate
Meas. Tech.
Akt Inhibition Assay
IC50
2119±n/a nM
Citation
 Lindsley, CWZhao, ZLeister, WHRobinson, RGBarnett, SFDefeo-Jones, DJones, REHartman, GDHuff, JRHuber, HEDuggan, ME Allosteric Akt (PKB) inhibitors: discovery and SAR of isozyme selective inhibitors. Bioorg Med Chem Lett 15:761-4 (2005)  
Target
Name:
RAC-gamma serine/threonine-protein kinase
Synonyms:
AKT3 PKB gamma Protein kinase Akt-3 Protein kinase B, gamma RAC-gamma serine/threonine-protein kinase Serine/threonine-protein kinase AKT | Serine/threonine-protein kinase AKT3
Type:
Enzyme
Mol. Mass.:
55769.36
Organism:
Homo sapiens (Human)
Description:
Residue:
479
  
Inhibitor
Name:
BDBM15169
Synonyms:
1-{1-[(4-{7-phenyl-1H-imidazo[4,5-g]quinoxalin-6-yl}phenyl)methyl]piperidin-4-yl}-2,3-dihydro-1H-1,3-benzodiazol-2-one imidazoquinoxaline | imidazoquinoxaline 16h
Type:
Small organic molecule
Emp. Form.:
C34H29N7O
Mol. Mass.:
551.6404
SMILES:
O=c1[nH]c2ccccc2n1C1CCN(Cc2ccc(cc2)-c2nc3cc4[nH]cnc4cc3nc2-c2ccccc2)CC1
:
Substrate
Name:
biotinylated Akt peptide substrate
Synonyms:
Type:
Peptide
Mol. Mass.:
1734.89
Organism:
Description:
Residue:
17
ITINGGRARTSSFAEPG