Target
Interleukin-1 receptor-associated kinase 4
Ligand
BDBM209444
Substrate
Meas. Tech.
Inhibition Assay
pH
7.2±n/a
Temperature
298.15±n/a K
IC50
2.00±n/a nM
Comments
extracted
Citation
 Bhide, RSDuncia, JVHynes, JNair, SKPitts, WJKumar, SRGardner, DSMurugesan, NPaidi, VRSantella, JBSistla, RWu, H Bicyclic heterocycle substituted pyridyl compounds useful as kinase modulators US Patent  US9546153 Publication Date 1/17/2017 
Target
Name:
Interleukin-1 receptor-associated kinase 4
Synonyms:
IRAK-4 IRAK4_HUMAN Interleukin-1 receptor-associated kinase 4 (IRAK4) | Renal carcinoma antigen NY-REN-64
Type:
Protein
Mol. Mass.:
51519.08
Organism:
Homo sapiens (Human)
Description:
Q9NWZ3
Residue:
460
  
Inhibitor
Name:
BDBM209444
Synonyms:
US9546153, ex. 136
Type:
Small organic molecule
Emp. Form.:
C21H24F3N5O2S
Mol. Mass.:
467.508
SMILES:
CC(F)(F)CNc1cc(Nc2ccc3ncsc3c2)ncc1C(=O)NC[C@@H](F)C(C)(C)O
: