Target
Somatostatin receptor type 3
Ligand
BDBM311875
Substrate
Meas. Tech.
Radioligand Binding Assay
Ki
>8580±n/a nM
Citation
 Giovannini, RCui, YDoods, HFerrara, MJust, SKuelzer, RLingard, IMazzaferro, RRudolf, K Somatostatin receptor subtype 4 (SSTR4) agonists US Patent  US9789082 Publication Date 10/17/2017 
Target
Name:
Somatostatin receptor type 3
Synonyms:
SOMATOSTATIN SST3 SS3-R SSR-28 SSTR3 | Somatostatin receptor type 3 (SSTR3)
Type:
Protein
Mol. Mass.:
45855.97
Organism:
Homo sapiens (Human)
Description:
P32745
Residue:
418
  
Inhibitor
Name:
BDBM311875
Synonyms:
US10166214, Example 11 US9789082, Example 11
Type:
Small organic molecule
Emp. Form.:
C16H19ClN4O
Mol. Mass.:
318.801
SMILES:
CC(C)(NC(=O)[C@@H]1[C@H]2CNC[C@@H]12)c1nc2ccc(Cl)cc2[nH]1
: