Target
Somatostatin receptor type 4
Ligand
BDBM311885
Substrate
Meas. Tech.
Radioligand Binding Assay
Ki
10.8±n/a nM
Citation
 Giovannini, RCui, YDoods, HFerrara, MJust, SKuelzer, RLingard, IMazzaferro, RRudolf, K Somatostatin receptor subtype 4 (SSTR4) agonists US Patent  US9789082 Publication Date 10/17/2017 
Target
Name:
Somatostatin receptor type 4
Synonyms:
SOMATOSTATIN SST4 SS4-R SSR4_HUMAN SSTR4 | Somatostatin receptor type 4 (SSTR4)
Type:
Enzyme
Mol. Mass.:
42015.38
Organism:
Homo sapiens (Human)
Description:
P31391
Residue:
388
  
Inhibitor
Name:
BDBM311885
Synonyms:
US10166214, Example 21 US9789082, Example 21
Type:
Small organic molecule
Emp. Form.:
C18H21N3O
Mol. Mass.:
295.3788
SMILES:
CC(C)(NC(=O)[C@@H]1[C@H]2CNC[C@@H]12)c1ccnc2ccccc12
: