Target
Somatostatin receptor type 2
Ligand
BDBM311885
Substrate
Meas. Tech.
Radioligand Binding Assay
Ki
>9590±n/a nM
Citation
 Giovannini, RCui, YDoods, HFerrara, MJust, SKuelzer, RLingard, IMazzaferro, RRudolf, K Somatostatin receptor subtype 4 (SSTR4) agonists US Patent  US9789082 Publication Date 10/17/2017 
Target
Name:
Somatostatin receptor type 2
Synonyms:
SOMATOSTATIN SST2 SS-2-R SS2R SSTR2 | Somatostatin receptor type 2 (SSTR2)
Type:
Enzyme
Mol. Mass.:
41344.94
Organism:
Homo sapiens (Human)
Description:
P30874
Residue:
369
  
Inhibitor
Name:
BDBM311885
Synonyms:
US10166214, Example 21 US9789082, Example 21
Type:
Small organic molecule
Emp. Form.:
C18H21N3O
Mol. Mass.:
295.3788
SMILES:
CC(C)(NC(=O)[C@@H]1[C@H]2CNC[C@@H]12)c1ccnc2ccccc12
: