Target
Somatostatin receptor type 2
Ligand
BDBM50081058
Substrate
Meas. Tech.
Radioligand Binding Assay
Ki
>9590±n/a nM
Citation
 Giovannini, RCui, YDoods, HFerrara, MJust, SKuelzer, RLingard, IMazzaferro, RRudolf, K Somatostatin receptor subtype 4 (SSTR4) agonists US Patent  US9789082 Publication Date 10/17/2017 
Target
Name:
Somatostatin receptor type 2
Synonyms:
SOMATOSTATIN SST2 SS-2-R SS2R SSTR2 | Somatostatin receptor type 2 (SSTR2)
Type:
Enzyme
Mol. Mass.:
41344.94
Organism:
Homo sapiens (Human)
Description:
P30874
Residue:
369
  
Inhibitor
Name:
BDBM50081058
Synonyms:
CHEMBL3421842 US10675268, Example 22 | US9789082, Example 22
Type:
Small organic molecule
Emp. Form.:
C19H23N3O
Mol. Mass.:
309.4054
SMILES:
[H][C@@]12CNC[C@]1([H])[C@H]2C(=O)NC(C)(C)c1nc(C)cc2ccccc12
: