Target
Somatostatin receptor type 5
Ligand
BDBM311889
Substrate
Meas. Tech.
Radioligand Binding Assay
Ki
>9855±n/a nM
Citation
 Giovannini, RCui, YDoods, HFerrara, MJust, SKuelzer, RLingard, IMazzaferro, RRudolf, K Somatostatin receptor subtype 4 (SSTR4) agonists US Patent  US9789082 Publication Date 10/17/2017 
Target
Name:
Somatostatin receptor type 5
Synonyms:
SOMATOSTATIN SST5 SS5-R SSR5_HUMAN Somatostatin receptor type 5 (SSTR5)
Type:
Enzyme
Mol. Mass.:
39218.02
Organism:
Homo sapiens (Human)
Description:
P35346
Residue:
364
  
Inhibitor
Name:
BDBM311889
Synonyms:
US10166214, Example 25 US9789082, Example 25
Type:
Small organic molecule
Emp. Form.:
C15H21N3O
Mol. Mass.:
259.3467
SMILES:
Cc1cccnc1C(C)(C)NC(=O)[C@@H]1[C@H]2CNC[C@@H]12
: