Target
Somatostatin receptor type 2
Ligand
BDBM311942
Substrate
Meas. Tech.
Radioligand Binding Assay
Ki
>9630±n/a nM
Citation
 Giovannini, RCui, YDoods, HFerrara, MJust, SKuelzer, RLingard, IMazzaferro, RRudolf, K Somatostatin receptor subtype 4 (SSTR4) agonists US Patent  US9789082 Publication Date 10/17/2017 
Target
Name:
Somatostatin receptor type 2
Synonyms:
SOMATOSTATIN SST2 SS-2-R SS2R SSTR2 | Somatostatin receptor type 2 (SSTR2)
Type:
Enzyme
Mol. Mass.:
41344.94
Organism:
Homo sapiens (Human)
Description:
P30874
Residue:
369
  
Inhibitor
Name:
BDBM311942
Synonyms:
US10166214, Example 78 US9789082, Example 78
Type:
Small organic molecule
Emp. Form.:
C18H22N4O
Mol. Mass.:
310.3935
SMILES:
Cc1cc2cccnc2c(n1)C(C)(C)NC(=O)[C@@H]1[C@H]2CNC[C@@H]12
: