Target
Somatostatin receptor type 2
Ligand
BDBM50081060
Substrate
Meas. Tech.
Radioligand Binding Assay
Ki
>9600±n/a nM
Citation
 Giovannini, RCui, YDoods, HFerrara, MJust, SKuelzer, RLingard, IMazzaferro, RRudolf, K Somatostatin receptor subtype 4 (SSTR4) agonists US Patent  US9789082 Publication Date 10/17/2017 
Target
Name:
Somatostatin receptor type 2
Synonyms:
SOMATOSTATIN SST2 SS-2-R SS2R SSTR2 | Somatostatin receptor type 2 (SSTR2)
Type:
Enzyme
Mol. Mass.:
41344.94
Organism:
Homo sapiens (Human)
Description:
P30874
Residue:
369
  
Inhibitor
Name:
BDBM50081060
Synonyms:
CHEMBL3421844 US10675268, Example 101 | US9789082, Example 101
Type:
Small organic molecule
Emp. Form.:
C16H18FN3O2
Mol. Mass.:
303.3314
SMILES:
[H][C@@]12CNC[C@]1([H])[C@H]2C(=O)NC(C)(C)c1noc2c(F)cccc12
: