Target
Indoleamine 2,3-dioxygenase 1
Ligand
BDBM223014
Substrate
Meas. Tech.
Enzyme Assay
IC50
<200±n/a nM
Citation
 Combs, APYue, EWSparks, RBZhu, W 1,2,5-oxadiazoles as inhibitors of indoleamine 2,3-dioxygenase US Patent  US9789094 Publication Date 10/17/2017 
Target
Name:
Indoleamine 2,3-dioxygenase 1
Synonyms:
I23O1_HUMAN IDO-1 INDO Indoleamine 2,3-dioxygenase | Indoleamine-pyrrole 2,3-dioxygenase
Type:
Enzyme
Mol. Mass.:
45330.80
Organism:
Homo sapiens (Human)
Description:
P14902
Residue:
403
  
Inhibitor
Name:
BDBM223014
Synonyms:
US10034939, Example 16 US11207302, Example 16 US9789094, 16
Type:
Small organic molecule
Emp. Form.:
C14H17F3N6O4S
Mol. Mass.:
422.383
SMILES:
CS(=O)(=O)NCCCNc1nonc1C(Nc1cccc(c1)C(F)(F)F)=NO
: