Target
Proto-oncogene tyrosine-protein kinase receptor Ret [658-1114]
Ligand
BDBM347336
Substrate
Meas. Tech.
Enzymatic Assay
IC50
<100±n/a nM
Citation
 Eidam, HS Compounds as rearranged during transfection (RET) inhibitors US Patent  US9789100 Publication Date 10/17/2017 
Target
Name:
Proto-oncogene tyrosine-protein kinase receptor Ret [658-1114]
Synonyms:
CDHF12 PTC Proto-oncogene tyrosine-protein kinase receptor Ret (aa 658-1114) RET Kinase (aa 658-1114) RET_HUMAN
Type:
Mol. Mass.:
51535.16
Organism:
Homo sapiens (Human)
Description:
P07949[658-1114]
Residue:
457
  
Inhibitor
Name:
BDBM347336
Synonyms:
US9789100, Example 24
Type:
Small organic molecule
Emp. Form.:
C22H16F6N2O3
Mol. Mass.:
470.3645
SMILES:
CCOc1cc(c[nH]c1=O)-c1ccc(CC(=O)Nc2cc(c(F)cc2F)C(F)(F)F)c(F)c1
: