Target
Proto-oncogene tyrosine-protein kinase receptor Ret [658-1114]
Ligand
BDBM347324
Substrate
Meas. Tech.
Enzymatic Assay
IC50
300±n/a nM
Citation
 Eidam, HS Compounds as rearranged during transfection (RET) inhibitors US Patent  US9789100 Publication Date 10/17/2017 
Target
Name:
Proto-oncogene tyrosine-protein kinase receptor Ret [658-1114]
Synonyms:
CDHF12 PTC Proto-oncogene tyrosine-protein kinase receptor Ret (aa 658-1114) RET Kinase (aa 658-1114) RET_HUMAN
Type:
Mol. Mass.:
51535.16
Organism:
Homo sapiens (Human)
Description:
P07949[658-1114]
Residue:
457
  
Inhibitor
Name:
BDBM347324
Synonyms:
N-(6-(2-Cyanopropan-2-yl)-5-(trifluoromethyl)pyridin-3-yl)-2-(4-(5-ethoxy-6-oxo-1,6-dihydropyridin-3-yl)-2-fluorophenyl)acetamide hydrochloride | US9789100, Example 12
Type:
Small organic molecule
Emp. Form.:
C25H22F4N4O3
Mol. Mass.:
502.4608
SMILES:
CCOc1cc(c[nH]c1=O)-c1ccc(CC(=O)Nc2cnc(c(c2)C(F)(F)F)C(C)(C)C#N)c(F)c1
: