Target
Proto-oncogene tyrosine-protein kinase receptor Ret [658-1114]
Ligand
BDBM347333
Substrate
Meas. Tech.
Enzymatic Assay
IC50
<100±n/a nM
Citation
 Eidam, HS Compounds as rearranged during transfection (RET) inhibitors US Patent  US9789100 Publication Date 10/17/2017 
Target
Name:
Proto-oncogene tyrosine-protein kinase receptor Ret [658-1114]
Synonyms:
CDHF12 PTC Proto-oncogene tyrosine-protein kinase receptor Ret (aa 658-1114) RET Kinase (aa 658-1114) RET_HUMAN
Type:
Mol. Mass.:
51535.16
Organism:
Homo sapiens (Human)
Description:
P07949[658-1114]
Residue:
457
  
Inhibitor
Name:
BDBM347333
Synonyms:
2-(4-(5-Ethoxy-6-oxo-1,6-dihydropyridin-3-yl)-2-fluorophenyl)-N-(4-((4-ethylpiperazin-1-yl)methyl)-3-(trifluoromethyl)phenyl)acetamide, dihydrochloride | US9789100, Example 21
Type:
Small organic molecule
Emp. Form.:
C29H32F4N4O3
Mol. Mass.:
560.583
SMILES:
CCOc1cc(c[nH]c1=O)-c1ccc(CC(=O)Nc2ccc(CN3CCN(CC)CC3)c(c2)C(F)(F)F)c(F)c1
: