Target
Proto-oncogene tyrosine-protein kinase receptor Ret [658-1114]
Ligand
BDBM347342
Substrate
Meas. Tech.
Enzymatic Assay
IC50
<100±n/a nM
Citation
 Eidam, HS Compounds as rearranged during transfection (RET) inhibitors US Patent  US9789100 Publication Date 10/17/2017 
Target
Name:
Proto-oncogene tyrosine-protein kinase receptor Ret [658-1114]
Synonyms:
CDHF12 PTC Proto-oncogene tyrosine-protein kinase receptor Ret (aa 658-1114) RET Kinase (aa 658-1114) RET_HUMAN
Type:
Mol. Mass.:
51535.16
Organism:
Homo sapiens (Human)
Description:
P07949[658-1114]
Residue:
457
  
Inhibitor
Name:
BDBM347342
Synonyms:
2-(4-(4-Ethoxy-6-oxo-1,6-dihydropyridin-3-yl)-2-fluorophenyl)-N-(5-(1,1,1-trifluoro-2-methylpropan-2-yl)isoxazol-3-yl)acetamide | US9789100, Example 30
Type:
Small organic molecule
Emp. Form.:
C22H21F4N3O4
Mol. Mass.:
467.4135
SMILES:
CCOc1cc(=O)[nH]cc1-c1ccc(CC(=O)Nc2cc(on2)C(C)(C)C(F)(F)F)c(F)c1
: