Target
Proto-oncogene tyrosine-protein kinase receptor Ret [658-1114]
Ligand
BDBM347349
Substrate
Meas. Tech.
Enzymatic Assay
IC50
5250±n/a nM
Citation
 Eidam, HS Compounds as rearranged during transfection (RET) inhibitors US Patent  US9789100 Publication Date 10/17/2017 
Target
Name:
Proto-oncogene tyrosine-protein kinase receptor Ret [658-1114]
Synonyms:
CDHF12 PTC Proto-oncogene tyrosine-protein kinase receptor Ret (aa 658-1114) RET Kinase (aa 658-1114) RET_HUMAN
Type:
Mol. Mass.:
51535.16
Organism:
Homo sapiens (Human)
Description:
P07949[658-1114]
Residue:
457
  
Inhibitor
Name:
BDBM347349
Synonyms:
2-(4-(4-ethoxy-6-oxo-1,6-dihydropyridin-3-yl)-2-fluorophenyl)-N-(6-(1,1,1-trifluoro-2-methylpropan-2-yl)pyridin-3-yl)acetamide hydrochloride | US9789100, Example 37
Type:
Small organic molecule
Emp. Form.:
C24H23F4N3O3
Mol. Mass.:
477.4513
SMILES:
CCOc1cc(=O)[nH]cc1-c1ccc(CC(=O)Nc2ccc(nc2)C(C)(C)C(F)(F)F)c(F)c1
: