Target
RAC-beta serine/threonine-protein kinase
Ligand
BDBM15199
Substrate
AKTide-2T
Meas. Tech.
PKB In Vitro Enzyme Assay
pH
7.2±n/a
Temperature
295.15±n/a K
IC50
6600±n/a nM
Citation
 Collins, ICaldwell, JFonseca, TDonald, ABavetsias, VHunter, LJGarrett, MDRowlands, MGAherne, GWDavies, TGBerdini, VWoodhead, SJDavis, DSeavers, LCWyatt, PGWorkman, PMcDonald, E Structure-based design of isoquinoline-5-sulfonamide inhibitors of protein kinase B. Bioorg Med Chem 14:1255-73 (2006)  
Target
Name:
RAC-beta serine/threonine-protein kinase
Synonyms:
AKT2 PKB beta Protein kinase B (Akt 2) Protein kinase B, beta RAC-alpha serine/threonine-protein kinase (AKT2) RAC-beta serine/threonine-protein kinase (AKT2) Serine/threonine-protein kinase AKT2 | Serine/threonine-protein kinase Rac alpha/beta
Type:
Enzyme
Mol. Mass.:
55766.64
Organism:
Homo sapiens (Human)
Description:
Residue:
481
  
Inhibitor
Name:
BDBM15199
Synonyms:
Isoquinoline-5-sulfonic acid (2-(2-(2-methoxybenzyloxy)ethylamino)ethyl)amide isoquinoline-5-sulfonamide 11
Type:
Small organic molecule
Emp. Form.:
C21H25N3O4S
Mol. Mass.:
415.506
SMILES:
COc1ccccc1COCCNCCNS(=O)(=O)c1cccc2cnccc12
:
Substrate
Name:
AKTide-2T
Synonyms:
AKT/PKB/Rac Protein Kinase Substrate
Type:
Peptide
Mol. Mass.:
1719.90
Organism:
Description:
Residue:
14
ARKRERTYSFGHHA