Target
Metabotropic glutamate receptor 5
Ligand
BDBM211550
Substrate
Meas. Tech.
Radioligand Binding Assay
pH
7.4±n/a
Temperature
298.15±n/a K
IC50
978±n/a nM
Comments
extracted
Citation
 Emmitte, KALindsley, CWConn, PJFelts, ASSmith, KA Substituted 6-aryl-imidazopyridine and 6-aryl-triazolopyridine carboxamide analogs as negative allosteric modulators of mGluR5 US Patent  US9550778 Publication Date 1/24/2017 
Target
Name:
Metabotropic glutamate receptor 5
Synonyms:
GRM5_RAT Grm5 Mglur5 metabotropic glutamate 5/1-C metabotropic glutamate 5a
Type:
Enzyme
Mol. Mass.:
131900.14
Organism:
Rattus norvegicus (Rat)
Description:
P31424
Residue:
1203
  
Inhibitor
Name:
BDBM211550
Synonyms:
US9550778, chem-us-00200
Type:
Small organic molecule
Emp. Form.:
C16H11FN6OS
Mol. Mass.:
354.362
SMILES:
Cc1csc(NC(=O)c2cc(cn3ncnc23)-c2cccnc2F)n1
: