Target
15-hydroxyprostaglandin dehydrogenase [NAD(+)]
Ligand
BDBM347366
Substrate
Meas. Tech.
In Vitro Assay
IC50
151±n/a nM
Citation
 Markowitz, SWillson, JKPosner, BReady, JAntczak, MZhang, YDesai, AGerson, SGreenlee, W Compositions and methods of modulating short-chain dehydrogenase activity US Patent  US9789116 Publication Date 10/17/2017 
Target
Name:
15-hydroxyprostaglandin dehydrogenase [NAD(+)]
Synonyms:
15-PGDH HPGD PGDH_HUMAN SDR36C1
Type:
Enzyme
Mol. Mass.:
28974.46
Organism:
Homo sapiens (Human)
Description:
P15428
Residue:
266
  
Inhibitor
Name:
BDBM347366
Synonyms:
US10301320, ID SW208064 US20230285402, ID # SW208064 | US9789116, SW208064
Type:
Small organic molecule
Emp. Form.:
C11H14N2OS2
Mol. Mass.:
254.372
SMILES:
CCCCS(=O)c1sc2ncccc2c1N
: