Target
15-hydroxyprostaglandin dehydrogenase [NAD(+)]
Ligand
BDBM347384
Substrate
Meas. Tech.
In Vitro Assay
IC50
1.14±n/a nM
Citation
 Markowitz, SWillson, JKPosner, BReady, JAntczak, MZhang, YDesai, AGerson, SGreenlee, W Compositions and methods of modulating short-chain dehydrogenase activity US Patent  US9789116 Publication Date 10/17/2017 
Target
Name:
15-hydroxyprostaglandin dehydrogenase [NAD(+)]
Synonyms:
15-PGDH HPGD PGDH_HUMAN SDR36C1
Type:
Enzyme
Mol. Mass.:
28974.46
Organism:
Homo sapiens (Human)
Description:
P15428
Residue:
266
  
Inhibitor
Name:
BDBM347384
Synonyms:
US10869871, ID # SW208436 US9789116, SW208436
Type:
Small organic molecule
Emp. Form.:
C19H18N4OS3
Mol. Mass.:
414.567
SMILES:
CCCCS(=O)c1sc2nc(nc(-c3ccccc3)c2c1N)-c1nccs1
: