Target
15-hydroxyprostaglandin dehydrogenase [NAD(+)]
Ligand
BDBM347398
Substrate
Meas. Tech.
In Vitro Assay
IC50
93.3±n/a nM
Citation
 Markowitz, SWillson, JKPosner, BReady, JAntczak, MZhang, YDesai, AGerson, SGreenlee, W Compositions and methods of modulating short-chain dehydrogenase activity US Patent  US9789116 Publication Date 10/17/2017 
Target
Name:
15-hydroxyprostaglandin dehydrogenase [NAD(+)]
Synonyms:
15-PGDH HPGD PGDH_HUMAN SDR36C1
Type:
Enzyme
Mol. Mass.:
28974.46
Organism:
Homo sapiens (Human)
Description:
P15428
Residue:
266
  
Inhibitor
Name:
BDBM347398
Synonyms:
US10869871, ID # SW208776 US9789116, SW208776
Type:
Small organic molecule
Emp. Form.:
C22H20N2OS2
Mol. Mass.:
392.537
SMILES:
CCCCS(=O)c1cc2c(nc(nc2s1)-c1ccccc1)-c1ccccc1
: