Target
15-hydroxyprostaglandin dehydrogenase [NAD(+)]
Ligand
BDBM347426
Substrate
Meas. Tech.
In Vitro Assay
IC50
6.14±n/a nM
Citation
 Markowitz, SWillson, JKPosner, BReady, JAntczak, MZhang, YDesai, AGerson, SGreenlee, W Compositions and methods of modulating short-chain dehydrogenase activity US Patent  US9789116 Publication Date 10/17/2017 
Target
Name:
15-hydroxyprostaglandin dehydrogenase [NAD(+)]
Synonyms:
15-PGDH HPGD PGDH_HUMAN SDR36C1
Type:
Enzyme
Mol. Mass.:
28974.46
Organism:
Homo sapiens (Human)
Description:
P15428
Residue:
266
  
Inhibitor
Name:
BDBM347426
Synonyms:
US10869871, ID # SW209331 US9789116, SW209331
Type:
Small organic molecule
Emp. Form.:
C20H17FN2OS3
Mol. Mass.:
416.555
SMILES:
Nc1c(sc2nc(cc(-c3ccccc3)c12)-c1cccs1)[S+]([O-])CCCF
: