Target
Mitogen-activated protein kinase 14 [G110A]
Ligand
BDBM15244
Substrate
biotinylated GST-ATF2
Meas. Tech.
Enzyme Inhibition Scintillation Proximity Assay
pH
7±n/a
Temperature
303.15±n/a K
IC50
34±n/a nM
Km
85000±12000 nM
Citation
 Fitzgerald, CEPatel, SBBecker, JWCameron, PMZaller, DPikounis, VBO'Keefe, SJScapin, G Structural basis for p38alpha MAP kinase quinazolinone and pyridol-pyrimidine inhibitor specificity. Nat Struct Biol 10:764-9 (2003)  
Target
Name:
Mitogen-activated protein kinase 14 [G110A]
Synonyms:
Crk1 Csbp2 MK14_MOUSE Mitogen-activated protein kinase 14 | Mitogen-activated protein kinase p38 alpha
Type:
Enzyme
Mol. Mass.:
41295.24
Organism:
Mus musculus (mouse)
Description:
Mutant was site-directed generated from wild-type p38alpha.
Residue:
360
  
Inhibitor
Name:
BDBM15244
Synonyms:
5-(2,6-dichlorophenyl)-2-(2,4-difluorophenyl)sulfanylpyrimido[1,6-b]pyridazin-6-one 5-(2,6-dichlorophenyl)-2-[(2,4-difluorophenyl)thio]-6-pyrimido[1,6-b]pyridazinone 5-(2,6-dichlorophenyl)-9-(2,4-difluorophenyl)sulfanyl-1,3,10-triazabicyclo[4.4.0]deca-2,5,7,9-tetraen-4-one VX-745 cid_3038525
Type:
Small organic molecule
Emp. Form.:
C19H9Cl2F2N3OS
Mol. Mass.:
436.262
SMILES:
Fc1ccc(Sc2ccc3c(-c4c(Cl)cccc4Cl)c(=O)ncn3n2)c(F)c1
:
Substrate
Name:
biotinylated GST-ATF2
Synonyms:
ATF-2-GST Activating transcription factor 2 GST-ATF2 biotinylated activating transcription factor 2
Type:
Other Protein Type
Mol. Mass.:
12237.77
Organism:
Homo sapiens (Human)
Description:
Residue:
109