Target
cGMP-inhibited 3',5'-cyclic phosphodiesterase 3A [388-1112]
Ligand
BDBM15303
Substrate
BDBM10851
Meas. Tech.
PDE SPA Enzyme Inhibition Assay
IC50
44±n/a nM
Citation
 Edmondson, SDMastracchio, AHe, JChung, CCForrest, MJHofsess, SMacIntyre, EMetzger, JO'Connor, NPatel, KTong, XTota, MRVan der Ploeg, LHVarnerin, JPFisher, MHWyvratt, MJWeber, AEParmee, ER Benzyl vinylogous amide substituted aryldihydropyridazinones and aryldimethylpyrazolones as potent and selective PDE3B inhibitors. Bioorg Med Chem Lett 13:3983-7 (2003)  
Target
Name:
cGMP-inhibited 3',5'-cyclic phosphodiesterase 3A [388-1112]
Synonyms:
CGI-PDE A PDE3A Phosphodiesterase Type 3 (PDE3A) cGMP-inhibited 3,5-cyclic phosphodiesterase A
Type:
Enzyme
Mol. Mass.:
80817.39
Organism:
Homo sapiens (Human)
Description:
PDE3A (388-1112) was expressed as soluble proteins in Escherichia coli.
Residue:
725
  
Inhibitor
Name:
BDBM15303
Synonyms:
(5R)-5-methyl-6-{4-[(2-methyl-3-oxocyclohex-1-en-1-yl)amino]phenyl}-2,3,4,5-tetrahydropyridazin-3-one | dihydropyridazinone 8b
Type:
Small organic molecule
Emp. Form.:
C18H21N3O2
Mol. Mass.:
311.3782
SMILES:
C[C@@H]1CC(=O)NN=C1c1ccc(NC2=C(C)C(=O)CCC2)cc1
:
Substrate
Name:
BDBM10851
Synonyms:
(4aR,6R,7R,7aS)-6-(6-amino-9H-purin-9-yl)-2,7-dihydroxy-hexahydro-1,3,5,2-furo[3,2-d][1,3,2]dioxaphosphinin-2-one ADENOSINE-3 ,5 -CYCLIC-MONOPHOSPHATE cAMP | cid_23902375
Type:
Small organic molecule
Emp. Form.:
C10H12N5O6P
Mol. Mass.:
329.2059
SMILES:
Nc1ncnc2n(cnc12)[C@@H]1O[C@@H]2COP(O)(=O)O[C@H]2[C@H]1O
: