Target
Proto-oncogene tyrosine-protein kinase Src
Ligand
BDBM256503
Substrate
Meas. Tech.
Enzyme Inhibition
IC50
12.0±n/a nM
Citation
 Thom, SM Kinase inhibitors US Patent  US9790174 Publication Date 10/17/2017 
Target
Name:
Proto-oncogene tyrosine-protein kinase Src
Synonyms:
Calmodulin/Proto-oncogene tyrosine-protein kinase Src Proto-oncogene c-Src SRC SRC_HUMAN V-src sarcoma (Schmidt-Ruppin A-2) viral oncogene homolog (avian) p60-Src | pp60c-src
Type:
Protein
Mol. Mass.:
59838.60
Organism:
Homo sapiens (Human)
Description:
P12931
Residue:
536
  
Inhibitor
Name:
BDBM256503
Synonyms:
US9481648, 1 | US9790174, Example 1
Type:
Small organic molecule
Emp. Form.:
C42H46N8O7S
Mol. Mass.:
806.929
SMILES:
COc1c(NC(=O)Nc2ccc(Oc3ccnc(Nc4cc(cc(c4)C(=O)NCCN4CCOCC4)C#C)n3)c3ccccc23)cc(cc1NS(C)(=O)=O)C(C)(C)C
: