Target
Proto-oncogene tyrosine-protein kinase Src
Ligand
BDBM347463
Substrate
Meas. Tech.
Enzyme Inhibition
IC50
14.0±n/a nM
Citation
 Thom, SM Kinase inhibitors US Patent  US9790174 Publication Date 10/17/2017 
Target
Name:
Proto-oncogene tyrosine-protein kinase Src
Synonyms:
Calmodulin/Proto-oncogene tyrosine-protein kinase Src Proto-oncogene c-Src SRC SRC_HUMAN V-src sarcoma (Schmidt-Ruppin A-2) viral oncogene homolog (avian) p60-Src | pp60c-src
Type:
Protein
Mol. Mass.:
59838.60
Organism:
Homo sapiens (Human)
Description:
P12931
Residue:
536
  
Inhibitor
Name:
BDBM347463
Synonyms:
N-(5-(tert-Butyl)-2-methoxy-3-(3-(4-((2-((3-methoxy-5-(2-(2-(2-methoxyethoxy)ethoxy)-ethoxy)phenyl)amino)pyrimidin-4-yl)oxy)naphthalen-1-yl)ureido)phenyl)methanesulfonamide US9790174, Example 4
Type:
Small organic molecule
Emp. Form.:
C41H50N6O8
Mol. Mass.:
754.8711
SMILES:
CNc1cc(cc(NC(=O)Nc2ccc(Oc3ccnc(Nc4cc(OC)cc(OCCOCCOCCOC)c4)n3)c3ccccc23)c1OC)C(C)(C)C
: