Target
Proto-oncogene tyrosine-protein kinase Src
Ligand
BDBM256548
Substrate
Meas. Tech.
Enzyme Inhibition
IC50
15.0±n/a nM
Citation
 Thom, SM Kinase inhibitors US Patent  US9790174 Publication Date 10/17/2017 
Target
Name:
Proto-oncogene tyrosine-protein kinase Src
Synonyms:
Calmodulin/Proto-oncogene tyrosine-protein kinase Src Proto-oncogene c-Src SRC SRC_HUMAN V-src sarcoma (Schmidt-Ruppin A-2) viral oncogene homolog (avian) p60-Src | pp60c-src
Type:
Protein
Mol. Mass.:
59838.60
Organism:
Homo sapiens (Human)
Description:
P12931
Residue:
536
  
Inhibitor
Name:
BDBM256548
Synonyms:
US10435361, Example 47 US9790174, Example 47
Type:
Small organic molecule
Emp. Form.:
C42H47N7O7
Mol. Mass.:
761.8653
SMILES:
COc1cc(Nc2cc(Oc3ccc(NC(=O)Nc4cc(cc(C(N)=O)c4OC)C(C)(C)C)c4ccccc34)ccn2)cc(c1)C(=O)NCCN1CCOCC1
: