Target
Histone deacetylase 1
Ligand
BDBM347471
Substrate
Meas. Tech.
Enzyme Assay
IC50
1.20±n/a nM
Citation
 van Duzer, JHMazitschek, R Piperidine derivatives as HDAC1/2 inhibitors US Patent  US9790180 Publication Date 10/17/2017 
Target
Name:
Histone deacetylase 1
Synonyms:
Cereblon/Histone deacetylase 1 HDAC1 Histone deacetylase 1 (HDAC1) RPD3L1
Type:
Enzyme
Mol. Mass.:
55090.27
Organism:
Homo sapiens (Human)
Description:
Q13547
Residue:
482
  
Inhibitor
Name:
BDBM347471
Synonyms:
US9790180, ID 005
Type:
Small organic molecule
Emp. Form.:
C28H34N6O2S
Mol. Mass.:
518.674
SMILES:
CN1CCN(CC1)C(=O)N1CCC(CC1)Nc1ccc(cc1)C(=O)Nc1cc(ccc1N)-c1cccs1
: