Target
Histone deacetylase 2
Ligand
BDBM347500
Substrate
IC50
20.0±n/a nM
Citation
 van Duzer, JHMazitschek, R Piperidine derivatives as HDAC1/2 inhibitors US Patent  US9790180 Publication Date 10/17/2017 
Target
Name:
Histone deacetylase 2
Synonyms:
Cereblon/Histone deacetylase 2 HDAC2 Histone deacetylase 2 (HDAC2) | Human HDAC2
Type:
Chromatin regulator; hydrolase; repressor
Mol. Mass.:
55356.54
Organism:
Homo sapiens (Human)
Description:
Q92769
Residue:
488
  
Inhibitor
Name:
BDBM347500
Synonyms:
US9790180, ID 032
Type:
Small organic molecule
Emp. Form.:
C28H32N6O2
Mol. Mass.:
484.5927
SMILES:
Nc1ccc(cc1NC(=O)c1ccc(NC2CCN(CC2)C(=O)N2CCCC2)cc1)-c1ccncc1
: