Target
Histone deacetylase 2
Ligand
BDBM347502
Substrate
IC50
346±n/a nM
Citation
 van Duzer, JHMazitschek, R Piperidine derivatives as HDAC1/2 inhibitors US Patent  US9790180 Publication Date 10/17/2017 
Target
Name:
Histone deacetylase 2
Synonyms:
Cereblon/Histone deacetylase 2 HDAC2 Histone deacetylase 2 (HDAC2) | Human HDAC2
Type:
Chromatin regulator; hydrolase; repressor
Mol. Mass.:
55356.54
Organism:
Homo sapiens (Human)
Description:
Q92769
Residue:
488
  
Inhibitor
Name:
BDBM347502
Synonyms:
US9790180, ID 034
Type:
Small organic molecule
Emp. Form.:
C38H35N7O2
Mol. Mass.:
621.7302
SMILES:
Nc1ccc(cc1NC(=O)c1cnc(nc1)N(C1CCN(CC1)C(=O)Cc1c[nH]c2ccccc12)c1ccccc1)-c1ccccc1
: