Target
Histone deacetylase 3
Ligand
BDBM347504
Substrate
IC50
>2000±n/a nM
Citation
 van Duzer, JHMazitschek, R Piperidine derivatives as HDAC1/2 inhibitors US Patent  US9790180 Publication Date 10/17/2017 
Target
Name:
Histone deacetylase 3
Synonyms:
HD3 HDAC3_HUMAN Human HDAC3 SMAP45
Type:
Enzyme
Mol. Mass.:
48829.55
Organism:
Homo sapiens (Human)
Description:
O15379
Residue:
428
  
Inhibitor
Name:
BDBM347504
Synonyms:
US9790180, ID 036
Type:
Small organic molecule
Emp. Form.:
C39H37N7O2
Mol. Mass.:
635.7568
SMILES:
Cc1[nH]c2ccccc2c1CC(=O)N1CCC(CC1)N(c1ccccc1)c1ncc(cn1)C(=O)Nc1cc(ccc1N)-c1ccccc1
: