Target
Dihydroorotate dehydrogenase (quinone), mitochondrial [H185A]
Ligand
BDBM15356
Substrate
BDBM15346
Meas. Tech.
DHODH Inhibition Assay
IC50
>200000±n/a nM
Citation
 Baldwin, JMichnoff, CHMalmquist, NAWhite, JRoth, MGRathod, PKPhillips, MA High-throughput screening for potent and selective inhibitors of Plasmodium falciparum dihydroorotate dehydrogenase. J Biol Chem 280:21847-53 (2005)  
Target
Name:
Dihydroorotate dehydrogenase (quinone), mitochondrial [H185A]
Synonyms:
DHOdehase Dihydroorotate dehydrogenase homolog | Dihydroorotate oxidase
Type:
Enzyme
Mol. Mass.:
65515.32
Organism:
Plasmodium falciparum
Description:
Q54A96[H185A]
Residue:
569
  
Inhibitor
Name:
BDBM15356
Synonyms:
1-naphthalen-1-yl-3-[2-(trifluoromethyl)phenyl]urea | SPECS compound no. 11
Type:
Small organic molecule
Emp. Form.:
C18H13F3N2O
Mol. Mass.:
330.3038
SMILES:
FC(F)(F)c1ccccc1NC(=O)Nc1cccc2ccccc12
:
Substrate
Name:
BDBM15346
Synonyms:
2,3-dimethoxy-5-methyl-cyclohexa-2,5-diene-1,4-dione Ubiquinone-0 (CoQ0)
Type:
Small organic molecule
Emp. Form.:
C9H10O4
Mol. Mass.:
182.1733
SMILES:
COC1=C(OC)C(=O)C(C)=CC1=O
: