Target
Free fatty acid receptor 1
Ligand
BDBM300868
Substrate
Meas. Tech.
Calcium Flux Assay
EC50
14.0±n/a nM
Citation
 Huang, HKuo, GPlayer, MRYang, SZhang, Y Substituted benzothiophenyl derivatives as GPR40 agonists for the treatment of type II diabetes US Patent  US9790198 Publication Date 10/17/2017 
Target
Name:
Free fatty acid receptor 1
Synonyms:
FFAR1 G-protein Coupled Receptor 40 | GPR40
Type:
G Protein-Coupled Receptor (GPCR)
Mol. Mass.:
31473.32
Organism:
Homo sapiens (Human)
Description:
O14842
Residue:
300
  
Inhibitor
Name:
BDBM300868
Synonyms:
(3S)-3-[4-([3-[2-(2- Methoxyethoxy)-6- methylphenyl]-1- benzothiophen-5- yl]methoxy)phenyl] hex-4-ynoic acid US10195178, Compound 66 | US9790198, Compound 66
Type:
Small organic molecule
Emp. Form.:
C31H30O5S
Mol. Mass.:
514.632
SMILES:
COCCOc1cccc(C)c1-c1csc2ccc(COc3ccc(cc3)[C@H](CC(O)=O)C#CC)cc12
: