Target
Prokineticin receptor 1
Ligand
BDBM347544
Substrate
Meas. Tech.
Biological Assay
IC50
830±n/a nM
Citation
 Bousba, SGoldby, AJenkins, KKinsella, NTeall, M Piperidine and azepine derivatives as prokineticin receptor modulators US Patent  US9790201 Publication Date 10/17/2017 
Target
Name:
Prokineticin receptor 1
Synonyms:
G-protein coupled receptor 73 GPR73 PK-R1 PKR1_HUMAN | PROKR1
Type:
enzyme
Mol. Mass.:
44779.92
Organism:
Homo sapiens (Human)
Description:
Q8TCW9
Residue:
393
  
Inhibitor
Name:
BDBM347544
Synonyms:
4-{[3-(4-Chlorophenyl)piperidin-1-yl]carbonyl}-2-(propan-2-yl)pyridine | US9790201, 30
Type:
Small organic molecule
Emp. Form.:
C20H23ClN2O
Mol. Mass.:
342.862
SMILES:
CC(C)c1cc(ccn1)C(=O)N1CCCC(C1)c1ccc(Cl)cc1
: