Target
Prokineticin receptor 1
Ligand
BDBM347574
Substrate
Meas. Tech.
Biological Assay
IC50
1600±n/a nM
Citation
 Bousba, SGoldby, AJenkins, KKinsella, NTeall, M Piperidine and azepine derivatives as prokineticin receptor modulators US Patent  US9790201 Publication Date 10/17/2017 
Target
Name:
Prokineticin receptor 1
Synonyms:
G-protein coupled receptor 73 GPR73 PK-R1 PKR1_HUMAN | PROKR1
Type:
enzyme
Mol. Mass.:
44779.92
Organism:
Homo sapiens (Human)
Description:
Q8TCW9
Residue:
393
  
Inhibitor
Name:
BDBM347574
Synonyms:
N,N-Dimethyl-4-({3-[2-(trifluoromethoxy)phenyl]piperidin-1-yl}carbonyl)pyridin-2-amine | US9790201, 60
Type:
Small organic molecule
Emp. Form.:
C20H22F3N3O2
Mol. Mass.:
393.4028
SMILES:
CN(C)c1cc(ccn1)C(=O)N1CCCC(C1)c1ccccc1OC(F)(F)F
: