Target
Prokineticin receptor 1
Ligand
BDBM347584
Substrate
Meas. Tech.
Biological Assay
IC50
120±n/a nM
Citation
 Bousba, SGoldby, AJenkins, KKinsella, NTeall, M Piperidine and azepine derivatives as prokineticin receptor modulators US Patent  US9790201 Publication Date 10/17/2017 
Target
Name:
Prokineticin receptor 1
Synonyms:
G-protein coupled receptor 73 GPR73 PK-R1 PKR1_HUMAN | PROKR1
Type:
enzyme
Mol. Mass.:
44779.92
Organism:
Homo sapiens (Human)
Description:
Q8TCW9
Residue:
393
  
Inhibitor
Name:
BDBM347584
Synonyms:
5-{[3-(4-Chloro-2-methylphenyl)piperidin-1-yl]carbonyl}-N,N-dimethylpyridazin-3-amine | US9790201, 70
Type:
Small organic molecule
Emp. Form.:
C19H23ClN4O
Mol. Mass.:
358.865
SMILES:
CN(C)c1cc(cnn1)C(=O)N1CCCC(C1)c1ccc(Cl)cc1C
: