Target
Heat shock protein HSP 90-beta
Ligand
BDBM15363
Substrate
BDBM15360
Meas. Tech.
Fluorescence Polarization (FP) Assay
pH
7.4±n/a
Temperature
295.15±n/a K
IC50
4730±n/a nM
Citation
 Dymock, BWBarril, XBrough, PACansfield, JEMassey, AMcDonald, EHubbard, RESurgenor, ARoughley, SDWebb, PWorkman, PWright, LDrysdale, MJ Novel, potent small-molecule inhibitors of the molecular chaperone Hsp90 discovered through structure-based design. J Med Chem 48:4212-5 (2005)  
Target
Name:
Heat shock protein HSP 90-beta
Synonyms:
HS90B_HUMAN HSP 90 HSP90B HSPCB Heat shock protein HSP 90 (Hsp90)
Type:
Molecular Chaperone
Mol. Mass.:
83229.45
Organism:
Homo sapiens (Human)
Description:
P08238
Residue:
724
  
Inhibitor
Name:
BDBM15363
Synonyms:
4-[4-(2,3-dihydro-1,4-benzodioxin-6-yl)-5-methyl-1H-pyrazol-3-yl]benzene-1,3-diol | CCT018159 analog 2
Type:
Small organic molecule
Emp. Form.:
C18H16N2O4
Mol. Mass.:
324.3306
SMILES:
Cc1[nH]nc(c1-c1ccc2OCCOc2c1)-c1ccc(O)cc1O
:
Substrate
Name:
BDBM15360
Synonyms:
5-[({4-[3-(5-chloro-2,4-dihydroxyphenyl)-1H-pyrazol-4-yl]phenyl}methyl)carbamoyl]-2-(6-hydroxy-3-oxo-3H-xanthen-9-yl)benzoic acid VER-00045864
Type:
Small organic molecule
Emp. Form.:
C37H24ClN3O8
Mol. Mass.:
674.055
SMILES:
OC(=O)c1cc(ccc1-c1c2ccc(O)cc2oc2cc(=O)ccc12)C(=O)NCc1ccc(cc1)-c1c[nH]nc1-c1cc(Cl)c(O)cc1O
: