Target
ATP-dependent molecular chaperone HSP82
Ligand
BDBM15361
Substrate
BDBM2
Meas. Tech.
Colorimetric Determination of ATPase Activity
pH
7.4±n/a
Temperature
310.15±n/a K
IC50
<200±n/a nM
Citation
 Wright, LBarril, XDymock, BSheridan, LSurgenor, ABeswick, MDrysdale, MCollier, AMassey, ADavies, NFink, AFromont, CAherne, WBoxall, KSharp, SWorkman, PHubbard, RE Structure-activity relationships in purine-based inhibitor binding to HSP90 isoforms. Chem Biol 11:775-85 (2004)  
Target
Name:
ATP-dependent molecular chaperone HSP82
Synonyms:
82 kDa heat shock protein HSP82 HSP90 Heat shock protein Hsp90 heat-inducible isoform
Type:
Molecular Chaperone
Mol. Mass.:
81369.08
Organism:
Saccharomyces cerevisiae
Description:
Histidine-tagged yeast HSP90 was transformed into E. coli and purified (>90%) by metal affinity, gel filtration, and ion-exchange chromatography.
Residue:
709
  
Inhibitor
Name:
BDBM15361
Synonyms:
(1aR,2Z,4E,14R,15aR)-8-chloro-9,11-dihydroxy-14-methyl-1a,14,15,15a-tetrahydro-6H-oxireno[e][2]benzoxacyclotetradecine-6,12(7H)-dione CHEMBL414883 Monorden | Radicicol
Type:
Antibiotic
Emp. Form.:
C18H17ClO6
Mol. Mass.:
364.777
SMILES:
[H][C@@]12C[C@@H](C)OC(=O)c3c(O)cc(O)c(Cl)c3CC(=O)C=CC=C[C@@]1([H])O2
:
Substrate
Name:
BDBM2
Synonyms:
({[({[(2R,3S,4R,5R)-5-(6-amino-9H-purin-9-yl)-3,4-dihydroxyoxolan-2-yl]methoxy}(hydroxy)phosphoryl)oxy](hydroxy)phosphoryl}oxy)phosphonic acid Brimonidine ATP | CHEMBL14249
Type:
Nucleoside or nucleotide
Emp. Form.:
C10H16N5O13P3
Mol. Mass.:
507.181
SMILES:
Nc1ncnc2n(cnc12)[C@@H]1O[C@H](COP(O)(=O)OP(O)(=O)OP(O)(O)=O)[C@@H](O)[C@H]1O
: