Target
Proto-oncogene tyrosine-protein kinase Src
Ligand
BDBM347660
Substrate
Meas. Tech.
Enzyme Inhibition
IC50
60.0±n/a nM
Citation
 Fyfe, MCMeghani, PStent, MAThom, SMWalshe, CA Kinase inhibitors US Patent  US9790209 Publication Date 10/17/2017 
Target
Name:
Proto-oncogene tyrosine-protein kinase Src
Synonyms:
Calmodulin/Proto-oncogene tyrosine-protein kinase Src Proto-oncogene c-Src SRC SRC_HUMAN V-src sarcoma (Schmidt-Ruppin A-2) viral oncogene homolog (avian) p60-Src | pp60c-src
Type:
Protein
Mol. Mass.:
59838.60
Organism:
Homo sapiens (Human)
Description:
P12931
Residue:
536
  
Inhibitor
Name:
BDBM347660
Synonyms:
1-(3-(2-Methylbut-3-yn-2-yl)-1-(p-tolyl)-1H-pyrazol-5-yl)-3-(4-((2-(phenylamino)pyrimidin-4-yl)oxy)naphthalen-1-yl)urea | US9790209, Example 1
Type:
Small organic molecule
Emp. Form.:
C36H31N7O2
Mol. Mass.:
593.677
SMILES:
Cc1ccc(cc1)-n1nc(cc1NC(=O)Nc1ccc(Oc2ccnc(Nc3ccccc3)n2)c2ccccc12)C(C)(C)C#C
: