Target
5-hydroxytryptamine receptor 2A
Ligand
BDBM347669
Substrate
Meas. Tech.
Enzyme Inhibition
IC50
46.0±n/a nM
Citation
 Fyfe, MCMeghani, PStent, MAThom, SMWalshe, CA Kinase inhibitors US Patent  US9790209 Publication Date 10/17/2017 
Target
Name:
5-hydroxytryptamine receptor 2A
Synonyms:
5-HT-2 5-HT2A 5-hydroxytryptamine receptor 2A (5HT-2A) 5HT2A_HUMAN HTR2A | Serotonin receptor 2A
Type:
undefined
Mol. Mass.:
52607.65
Organism:
Homo sapiens (Human)
Description:
P28223
Residue:
471
  
Inhibitor
Name:
BDBM347669
Synonyms:
1-(4-((2-((6-(2-(Dimethylamino)ethoxy)pyridin-2-yl)amino)pyrimidin-4-yl)oxy)naphthalen-1-yl)-3-(3-(2-methylbut-3-yn-2-yl)-1-(p-tolyl)-1H-pyrazol-5-yl)urea | US9790209, Example 10
Type:
Small organic molecule
Emp. Form.:
C39H39N9O3
Mol. Mass.:
681.7855
SMILES:
CN(C)CCOc1cccc(Nc2nccc(Oc3ccc(NC(=O)Nc4cc(nn4-c4ccc(C)cc4)C(C)(C)C#C)c4ccccc34)n2)n1
: