Target
Glycogen synthase kinase-3 alpha
Ligand
BDBM347670
Substrate
Meas. Tech.
Enzyme Inhibition
IC50
10000±n/a nM
Citation
 Fyfe, MCMeghani, PStent, MAThom, SMWalshe, CA Kinase inhibitors US Patent  US9790209 Publication Date 10/17/2017 
Target
Name:
Glycogen synthase kinase-3 alpha
Synonyms:
GSK-3 alpha GSK3A_HUMAN Glycogen synthase kinase-3 Glycogen synthase kinase-3 alpha (GSK3 Alpha) Glycogen synthase kinase-3 alpha (GSK3alpha)
Type:
Enzyme
Mol. Mass.:
50991.79
Organism:
Homo sapiens (Human)
Description:
P49840
Residue:
483
  
Inhibitor
Name:
BDBM347670
Synonyms:
1-(4-((2-((4-(2-(Dimethylamino)ethoxy)pyridin-2-yl)amino)pyrimidin-4-yl)oxy)naphthalen-1-yl)-3-(3-(2-methylbut-3-yn-2-yl)-1-(p-tolyl)-1H-pyrazol-5-yl)urea | US9790209, Example 11
Type:
Small organic molecule
Emp. Form.:
C39H39N9O3
Mol. Mass.:
681.7855
SMILES:
CN(C)CCOc1ccnc(Nc2nccc(Oc3ccc(NC(=O)Nc4cc(nn4-c4ccc(C)cc4)C(C)(C)C#C)c4ccccc34)n2)c1
: