Target
Tyrosine-protein kinase SYK
Ligand
BDBM347672
Substrate
Meas. Tech.
Enzyme Inhibition
IC50
61.0±n/a nM
Citation
 Fyfe, MCMeghani, PStent, MAThom, SMWalshe, CA Kinase inhibitors US Patent  US9790209 Publication Date 10/17/2017 
Target
Name:
Tyrosine-protein kinase SYK
Synonyms:
KSYK_HUMAN Spleen Tyrosine Kinase Tyrosine-protein kinase SYK (Syk)
Type:
Enzyme
Mol. Mass.:
72079.99
Organism:
Homo sapiens (Human)
Description:
P43405
Residue:
635
  
Inhibitor
Name:
BDBM347672
Synonyms:
1-(4-((2-((3-Methoxy-5-(2-(2-(2-methoxyethoxy)ethoxy)ethoxy)phenyl)amino)pyrimidin-4-yl)oxy)naphthalen-1-yl)-3-(3-(2-methylbut-3-yn-2-yl)-1-(p-tolyl)-1H-pyrazol-5-yl)urea | US9790209, Example 13
Type:
Small organic molecule
Emp. Form.:
C44H47N7O7
Mol. Mass.:
785.8867
SMILES:
COCCOCCOCCOc1cc(Nc2nccc(Oc3ccc(NC(=O)Nc4cc(nn4-c4ccc(C)cc4)C(C)(C)C#C)c4ccccc34)n2)cc(OC)c1
: