Target
Histone-binding protein RBBP4/Histone-lysine N-methyltransferase EZH2/Polycomb protein EED/Polycomb protein SUZ12/Zinc finger protein AEBP2
Ligand
BDBM259340
Substrate
Meas. Tech.
Scintillation Proximity Assay (SPA)
IC50
630±n/a nM
Citation
 Blackledge, Jr., CWBurgess, JLJohnson, NWKasparec, JKnight, SDLaFrance, III, LVLuengo, JIMiller, WHNewlander, KARomeril, SPSchulz, MSu, DTian, X Enhancer of zeste homolog 2 inhibitors US Patent  US9790212 Publication Date 10/17/2017 
Target
Name:
Histone-binding protein RBBP4/Histone-lysine N-methyltransferase EZH2/Polycomb protein EED/Polycomb protein SUZ12/Zinc finger protein AEBP2
Synonyms:
PRC2 complex | Polycomb Repressor Complex 2 (PRC2)
Type:
Protein
Mol. Mass.:
Description:
Components:
This complex has 5 components.
Component 1
Name:
Polycomb protein EED
Synonyms:
EED WAIT-1 hEED
Type:
Protein
Mol. Mass.:
50201.68
Organism:
Homo sapiens (Human)
Description:
O75530
Residue:
441
  
Component 2
Name:
Polycomb protein SUZ12
Synonyms:
CHET9 Chromatin precipitated E2F target 9 protein Joined to JAZF1 protein Polycomb protein SUZ12 SUZ12 Suppressor of zeste 12 protein homolog
Type:
Protein
Mol. Mass.:
83080.09
Organism:
Homo sapiens (Human)
Description:
Q15022
Residue:
739
  
Component 3
Name:
Histone-binding protein RBBP4
Synonyms:
RBAP48 RBBP4_HUMAN | Retinoblastoma-binding protein p48 (RBAP48)
Type:
Protein
Mol. Mass.:
47627.91
Organism:
Homo sapiens (Human)
Description:
Q09028
Residue:
425
  
Component 4
Name:
Zinc finger protein AEBP2
Synonyms:
AEBP2 Adipocyte enhancer-binding protein 2 (AEBP2) | Zinc finger protein AEBP2
Type:
Protein
Mol. Mass.:
54448.84
Organism:
Homo sapiens (Human)
Description:
Q6ZN18
Residue:
517
  
Component 5
Name:
Histone-lysine N-methyltransferase EZH2
Synonyms:
ENX-1 EZH2_HUMAN Histone-lysine N-methyltransferase EZH2 Lysine N-methyltransferase 6
Type:
Protein
Mol. Mass.:
85367.84
Organism:
Homo sapiens (Human)
Description:
Q15910
Residue:
746
  
Inhibitor
Name:
BDBM259340
Synonyms:
US9505745, 17 | US9790212, Example 17
Type:
Small organic molecule
Emp. Form.:
C24H33F3N4O2S
Mol. Mass.:
498.605
SMILES:
CCN([C@H]1CC[C@@H](CC1)N(C)C)c1scc(C(=O)NCc2c(C)cc([nH]c2=O)C(F)(F)F)c1C
: