Target
Dipeptidyl peptidase 4
Ligand
BDBM15510
Substrate
BDBM11057
Meas. Tech.
DPP Inhibition Assay
pH
7.5±n/a
Temperature
295.15±n/a K
Ki
7.1±n/a nM
Citation
 Pei, ZLi, Xvon Geldern, TWLongenecker, KPireh, DStewart, KDBackes, BJLai, CLubben, THBallaron, SJBeno, DWKempf-Grote, AJSham, HLTrevillyan, JM Discovery and structure-activity relationships of piperidinone- and piperidine-constrained phenethylamines as novel, potent, and selective dipeptidyl peptidase IV inhibitors. J Med Chem 50:1983-7 (2007)  
Target
Name:
Dipeptidyl peptidase 4
Synonyms:
ADABP Adenosine deaminase complexing protein 2 CD_antigen=CD26 DPP4 DPPIV Dipeptidyl peptidase 4 (DPP IV) Dipeptidyl peptidase 4 (DPP4) Dipeptidyl peptidase 4 membrane form Dipeptidyl peptidase IV Dipeptidyl peptidase IV (DDP-IV) Dipeptidyl peptidase IV membrane form Dipeptidyl peptidase-IV (DPP-4) T-cell activation antigen CD26 | TP103
Type:
Enzyme
Mol. Mass.:
88271.01
Organism:
Homo sapiens (Human)
Description:
P27487
Residue:
766
  
Inhibitor
Name:
BDBM15510
Synonyms:
(4R,5R)-5-amino-1-(2-(benzo[d][1,3]dioxol-5-yl)ethyl)-4-(2,4,5-trifluorophenyl)-piperidin-2-one 4, 5-trans -5-amino-1-(2-(benzo[d][1,3]dioxol-5-yl)ethyl)-4-(2, 4, 5-trifluorophenyl)piperidin-2-one Piperidinone-Constrained Phenethylamine 31 | Racemic mixture
Type:
Small organic molecule
Emp. Form.:
C20H19F3N2O3
Mol. Mass.:
392.3717
SMILES:
N[C@H]1CN(CCc2ccc3OCOc3c2)C(=O)C[C@@H]1c1cc(F)c(F)cc1F
:
Substrate
Name:
BDBM11057
Synonyms:
1-(2-aminoacetyl)-N-(4-methyl-2-oxo-2H-chromen-7-yl)pyrrolidine-2-carboxamide hydrobromide Gly-Pro-7-amidomethylcoumarin | Gly-Pro-AMC
Type:
Small organic molecule
Emp. Form.:
C17H19N3O4
Mol. Mass.:
329.3505
SMILES:
Cc1cc(=O)oc2cc(NC(=O)C3CCCN3C(=O)CN)ccc12
: