Target
Cytochrome P450 11B2, mitochondrial
Ligand
BDBM347694
Substrate
Meas. Tech.
Inhibition Assay
EC50
0.061±n/a nM
Citation
 Aebi, JAmrein, KHornsperger, BKuhn, BLi, DLiu, YMaerki, HPMartin, REMayweg, AVTan, XWang, LWu, J Pyridinyloxy- and phenyloxy-pyrazolyl compounds US Patent  US9790217 Publication Date 10/17/2017 
Target
Name:
Cytochrome P450 11B2, mitochondrial
Synonyms:
Aldosterone Synthase (CYP11B2) Aldosterone-synthesizing enzyme CYP11B2 Cytochrome P450 11B2 Cytochrome P450 11B2, mitochondrial P-450C18 | Steroid 18-hydroxylase
Type:
Protein
Mol. Mass.:
57582.15
Organism:
Homo sapiens (Human)
Description:
P19099
Residue:
503
  
Inhibitor
Name:
BDBM347694
Synonyms:
(E)-1-(2-Chloro-4-methylsulfanyl- phenyl)-2-(4-chlorophenoxy)-3- (dimethylamino)prop-2-en-1-one | US9790217, 17
Type:
Small organic molecule
Emp. Form.:
C18H17Cl2NO2S
Mol. Mass.:
382.304
SMILES:
CSc1ccc(C(=O)C(\Oc2ccc(Cl)cc2)=C/N(C)C)c(Cl)c1
: