Target
Cytochrome P450 11B1, mitochondrial
Ligand
BDBM347699
Substrate
Meas. Tech.
Inhibition Assay
EC50
0.842±n/a nM
Citation
 Aebi, JAmrein, KHornsperger, BKuhn, BLi, DLiu, YMaerki, HPMartin, REMayweg, AVTan, XWang, LWu, J Pyridinyloxy- and phenyloxy-pyrazolyl compounds US Patent  US9790217 Publication Date 10/17/2017 
Target
Name:
Cytochrome P450 11B1, mitochondrial
Synonyms:
C11B1_HUMAN CYPXIB1 Cytochrome P450 11B1 Cytochrome P450 11B1, mitochondrial | S11BH
Type:
Enzyme
Mol. Mass.:
57591.44
Organism:
Homo sapiens (Human)
Description:
P15538
Residue:
503
  
Inhibitor
Name:
BDBM347699
Synonyms:
(E)-1-(2,4-Dichlorophenyl)-3- (dimethylamino)-2-[(6-fluoro-2- pyridyl)oxy]prop-2-en-1-one | US9790217, 21
Type:
Small organic molecule
Emp. Form.:
C16H13Cl2FN2O2
Mol. Mass.:
355.191
SMILES:
CN(C)\C=C(\Oc1cccc(F)n1)C(=O)c1ccc(Cl)cc1Cl
: