Target
Cytochrome P450 11B2, mitochondrial
Ligand
BDBM347709
Substrate
Meas. Tech.
Inhibition Assay
EC50
0.046±n/a nM
Citation
 Aebi, JAmrein, KHornsperger, BKuhn, BLi, DLiu, YMaerki, HPMartin, REMayweg, AVTan, XWang, LWu, J Pyridinyloxy- and phenyloxy-pyrazolyl compounds US Patent  US9790217 Publication Date 10/17/2017 
Target
Name:
Cytochrome P450 11B2, mitochondrial
Synonyms:
Aldosterone Synthase (CYP11B2) Aldosterone-synthesizing enzyme CYP11B2 Cytochrome P450 11B2 Cytochrome P450 11B2, mitochondrial P-450C18 | Steroid 18-hydroxylase
Type:
Protein
Mol. Mass.:
57582.15
Organism:
Homo sapiens (Human)
Description:
P19099
Residue:
503
  
Inhibitor
Name:
BDBM347709
Synonyms:
4-[(Z)-1-(3-Chlorobenzoyl)-2- (dimethylamino)vinyloxy]benzonitrile | US9790217, 32
Type:
Small organic molecule
Emp. Form.:
C18H15ClN2O2
Mol. Mass.:
326.777
SMILES:
CN(C)\C=C(/Oc1ccc(cc1)C#N)C(=O)c1cccc(Cl)c1
: