Target
Cytochrome P450 11B2, mitochondrial
Ligand
BDBM347714
Substrate
Meas. Tech.
Inhibition Assay
EC50
0.317±n/a nM
Citation
 Aebi, JAmrein, KHornsperger, BKuhn, BLi, DLiu, YMaerki, HPMartin, REMayweg, AVTan, XWang, LWu, J Pyridinyloxy- and phenyloxy-pyrazolyl compounds US Patent  US9790217 Publication Date 10/17/2017 
Target
Name:
Cytochrome P450 11B2, mitochondrial
Synonyms:
Aldosterone Synthase (CYP11B2) Aldosterone-synthesizing enzyme CYP11B2 Cytochrome P450 11B2 Cytochrome P450 11B2, mitochondrial P-450C18 | Steroid 18-hydroxylase
Type:
Protein
Mol. Mass.:
57582.15
Organism:
Homo sapiens (Human)
Description:
P19099
Residue:
503
  
Inhibitor
Name:
BDBM347714
Synonyms:
4-[(Z)-1-(2-Chloropyridine-4- carbonyl)-2- (dimethylamino)vinyloxy]benzonitrile | US9790217, 37
Type:
Small organic molecule
Emp. Form.:
C17H14ClN3O2
Mol. Mass.:
327.765
SMILES:
CN(C)\C=C(/Oc1ccc(cc1)C#N)C(=O)c1ccnc(Cl)c1
: