Target
Cytochrome P450 11B2, mitochondrial
Ligand
BDBM347719
Substrate
Meas. Tech.
Inhibition Assay
EC50
0.030±n/a nM
Citation
 Aebi, JAmrein, KHornsperger, BKuhn, BLi, DLiu, YMaerki, HPMartin, REMayweg, AVTan, XWang, LWu, J Pyridinyloxy- and phenyloxy-pyrazolyl compounds US Patent  US9790217 Publication Date 10/17/2017 
Target
Name:
Cytochrome P450 11B2, mitochondrial
Synonyms:
Aldosterone Synthase (CYP11B2) Aldosterone-synthesizing enzyme CYP11B2 Cytochrome P450 11B2 Cytochrome P450 11B2, mitochondrial P-450C18 | Steroid 18-hydroxylase
Type:
Protein
Mol. Mass.:
57582.15
Organism:
Homo sapiens (Human)
Description:
P19099
Residue:
503
  
Inhibitor
Name:
BDBM347719
Synonyms:
5-(2-Chloro-4-methylsulfonylphenyl)-4-(4-chlorophenoxy)-1H-pyrazole | US9790217, 42
Type:
Small organic molecule
Emp. Form.:
C16H12Cl2N2O3S
Mol. Mass.:
383.249
SMILES:
CS(=O)(=O)c1ccc(-c2[nH]ncc2Oc2ccc(Cl)cc2)c(Cl)c1
: