Target
Cytochrome P450 11B2, mitochondrial
Ligand
BDBM347752
Substrate
Meas. Tech.
Inhibition Assay
EC50
0.020±n/a nM
Citation
 Aebi, JAmrein, KHornsperger, BKuhn, BLi, DLiu, YMaerki, HPMartin, REMayweg, AVTan, XWang, LWu, J Pyridinyloxy- and phenyloxy-pyrazolyl compounds US Patent  US9790217 Publication Date 10/17/2017 
Target
Name:
Cytochrome P450 11B2, mitochondrial
Synonyms:
Aldosterone Synthase (CYP11B2) Aldosterone-synthesizing enzyme CYP11B2 Cytochrome P450 11B2 Cytochrome P450 11B2, mitochondrial P-450C18 | Steroid 18-hydroxylase
Type:
Protein
Mol. Mass.:
57582.15
Organism:
Homo sapiens (Human)
Description:
P19099
Residue:
503
  
Inhibitor
Name:
BDBM347752
Synonyms:
4-[[3-[3-[[3-Fluoro-3-(hydroxymethyl)azetidin-1-yl]methyl]phenyl]-1H-pyrazol-4-yl]oxy]benzonitrile | US9790217, 74
Type:
Small organic molecule
Emp. Form.:
C21H19FN4O2
Mol. Mass.:
378.3996
SMILES:
OCC1(F)CN(Cc2cccc(c2)-c2[nH]ncc2Oc2ccc(cc2)C#N)C1
: