Target
Cytochrome P450 11B2, mitochondrial
Ligand
BDBM347755
Substrate
Meas. Tech.
Inhibition Assay
EC50
0.0003±n/a nM
Comments
0.0000 20220115
Citation
 Aebi, JAmrein, KHornsperger, BKuhn, BLi, DLiu, YMaerki, HPMartin, REMayweg, AVTan, XWang, LWu, J Pyridinyloxy- and phenyloxy-pyrazolyl compounds US Patent  US9790217 Publication Date 10/17/2017 
Target
Name:
Cytochrome P450 11B2, mitochondrial
Synonyms:
Aldosterone Synthase (CYP11B2) Aldosterone-synthesizing enzyme CYP11B2 Cytochrome P450 11B2 Cytochrome P450 11B2, mitochondrial P-450C18 | Steroid 18-hydroxylase
Type:
Protein
Mol. Mass.:
57582.15
Organism:
Homo sapiens (Human)
Description:
P19099
Residue:
503
  
Inhibitor
Name:
BDBM347755
Synonyms:
CHEM-US-00172 | US9790217, 77
Type:
Small organic molecule
Emp. Form.:
C21H15N5O2
Mol. Mass.:
369.3761
SMILES:
N#Cc1ccc(Oc2cn[nH]c2-c2ccccc2OCc2ccnnc2)cc1
: